{"text_format":"3","workbook":"xlsx","n_sheets":3,"sheets":["Poptávka","formátovací list","export"],"not_rendered":{"images":3,"defined_names":5,"comments":2},"read":"whole","date_system":"1900"}

{"sheet":"Poptávka","index":0,"n_rows":59,"n_cols":45,"rows_kept":59,"merged":[[2,3,2,9],[2,12,2,17],[3,3,3,5],[3,12,3,13],[3,14,3,15],[5,1,5,4],[5,6,5,7],[5,9,5,11],[5,12,8,16],[6,1,6,4],[6,5,6,6],[6,7,6,11],[7,1,7,4],[7,6,7,11],[8,1,8,4],[8,6,8,11],[9,3,9,4],[9,5,9,6],[9,7,9,10],[9,11,9,12],[9,13,9,14],[9,15,9,16],[10,1,10,2],[10,3,10,4],[10,5,10,6],[10,7,10,10],[10,11,10,12],[10,13,10,14],[10,15,10,16],[11,1,11,2],[11,3,11,4],[11,5,11,6],[11,7,11,10],[11,11,11,14],[11,15,11,16],[11,19,11,27],[12,1,12,2],[12,3,12,4],[12,5,12,6],[12,7,12,10],[12,11,12,14],[12,15,12,16],[13,1,13,2],[13,3,13,4],[13,5,13,6],[13,7,13,10],[13,15,13,16],[13,19,13,27],[13,30,13,38],[14,1,14,3],[14,4,14,16],[15,1,16,1],[15,2,16,2],[15,3,15,5],[15,6,16,6],[15,7,15,8],[15,9,16,10],[15,11,15,16],[15,20,16,20],[15,21,16,21],[15,22,16,22],[15,25,15,29],[15,42,15,44],[17,19,17,20],[18,19,18,20],[23,19,23,20],[53,11,53,12],[53,13,53,14],[53,15,53,16],[54,1,54,7],[54,8,54,10],[54,11,54,16],[56,11,56,12],[56,15,57,16],[58,1,58,2],[58,3,58,5],[58,7,58,10],[58,11,58,15]]}
[{"$nulls":16},"v 1.9",null,null,"prořez LTD",{"v":1.3,"d":"1.3 %"}]
[{"$nulls":3},"Lis Plast s.r.o.    Nám. T.G.Masaryka 729/7    Břeclav    69002   Ico 26216761   Dic CZ26216761",{"$nulls":15},"prořez ABS",{"v":0.08,"d":"0.080 bm"}]
[{"$nulls":3},"Lis Plast s.r.o.    U Malého lesa 1782/14   Žďár nad Sázavou 59101",{"$nulls":8},"566629979     606753330 ",{"$nulls":6},"formát",{"$f":"N11*P11/1000000","v":{"v":3.416,"d":"3.416 m2"}}]
[{"$nulls":3},"lisplast@lisplast.cz",{"$nulls":10},"  /  2023",{"$nulls":4},"řezáni",{"v":12,"d":"12 m.d."}]
[{"$nulls":19},"hranění",{"v":20,"d":"20 m.d."}]
[null," Firma (obchodní jméno):",{"$nulls":3}," IČO:",null,null,"DIČ:",{"$nulls":10},"pant",{"v":25,"d":"25 kč/1ks"}]
[{"$nulls":5}," Kontaktní osoba:",{"$nulls":13},"drážka",{"v":35,"d":"35 kč"}]
[null," Ulice , Město , Psč",{"$nulls":3}," Tel.:",{"$nulls":13},"falc",{"v":35,"d":"35 kč"}]
[{"$nulls":5}," e-mail:"]
[null,null,"uprava ceny       LTD","Dekor",null,"Cena",null,"Orientační cena materialu",{"$nulls":3},"Tloušťka",null,"Délka = x",null,"Šířka = y"]
[null,"Plošný materiál",{"$nulls":5},{"$f":"IF($I$54>0,$F$11*($I$54*$U$1)+B10,\"\")","v":""},{"$nulls":3},{"v":18,"d":"18 mm"},null,{"v":2800,"d":"2,800 mm"},null,{"v":1220,"d":"1,220 mm"}]
[null,"ABS 0,5 mm",{"$nulls":5},{"$f":"IF($L$54>0,$F$12*$L$54,\"\")","v":""},{"$nulls":3},"cena řezání",{"$nulls":3},{"$f":"IF($H$54>0,$H$54*$U$4,\"\")","v":""},{"$nulls":3},"!!!   uvedené rozměry přířezů jsou před ohraněním   !!!"]
[null,"ABS 1 mm",{"$nulls":5},{"$f":"IF($N$54>0,$F$13*$N$54,\"\")","v":""},{"$nulls":3},"cena hranění",{"$nulls":3},{"$f":"IF($L$55>0,IF($L$11=0,\"\",IF(L11<23,$L$55*$U$5,IF(L11>22,$L$55*($U$5+5),\"\"))),\"\")","v":""}]
[null,"ABS 2 mm",{"$nulls":5},{"$f":"IF($P$54>0,$F$14*$P$54,\"\")","v":""},{"$nulls":4},"cena frézování / vrtání",null,null,{"$f":"SUM($AQ$18:$AQ$53,$AR$18:$AR$53,$AS$18:$AS$53)+L14","v":{"v":0,"d":"0 kč"}},{"$nulls":3},"►►►   UVEDENÉ ROZMĚRY PŘÍŘEZŮ JSOU VČETNĚ HRANY   ◄◄◄"]
[null,"Řezaní + Hranění",null,null,{"$f":"IF(B15=T18,T12,T14)","v":"►►►   UVEDENÉ ROZMĚRY PŘÍŘEZŮ JSOU VČETNĚ HRANY   ◄◄◄"},{"$nulls":14},false]
[null,"Číslo dílce","Název","Rozměry (mm)",null,null,"Počet ks","Řezání",null,"Drážka Falc Pant",null,"Umístění hran",{"$nulls":8},"Typ služby","typ frezovani","lepená hrana",null,null,"PODMÍNKY",{"$nulls":16},"PODMÍNKY"]
[{"$nulls":3},"X= po letech","x","Y= napříč let",null,"m.d.","m2",null,null,"ABS 0,5","bm","ABS 1","bm","ABS 2","bm",{"$nulls":8},"ABS 0,5",null,"ABS 1",null,"ABS 2",{"$nulls":12},"pant","drážka","falc"]
[null,1,null,null,{"$f":"IF($D18=\"\",\"\",1)","v":""},null,null,{"$f":"IF($I18>0,((($D18+$F18)*2)/1000)*$G18,\"\")","v":0},{"$f":"IF($G18>0,(($D18*$F18)/1000000)*$G18,\"\")","v":""},{"$nulls":3},{"$f":"IF($Z18>0,$Z18,(((($D18/1000)+prořez)*2)+((($F18/1000)+prořez)*2))*$G18)","v":""},null,{"$f":"IF($AB18>0,$AB18,(((($D18/1000)+prořez)*2)+((($F18/1000)+prořez)*2))*$G18)","v":""},null,{"$f":"IF($AD18>0,$AD18,(((($D18/1000)+prořez)*2)+((($F18/1000)+prořez)*2))*$G18)","v":""},null,null,"Řezání",null,"pant","X",null,null,{"$f":"IF(L18=\"X\",((($D18/1000)+prořez)*1)*$G18,IF(L18=\"Y\",((($F18/1000)+prořez)*1)*$G18,IF(L18=\"XX\",((($D18/1000)+prořez)*2)*$G18,IF(L18=\"YY\",((($F18/1000)+prořez)*2)*$G18,IF(L18=\"XY\",(((($D18/1000)+prořez))+(($F18/1000)+prořez))*$G18,IF(L18=\"XXY\",(((($D18/1000)+prořez)*2)+(($F18/1000)+prořez))*$G18,IF(L18=\"XYY\",(((($D18/1000)+prořez)+((($F18/1000)+prořez)*2)))*$G18,IF(L18=\"\",\"\",0))))))))","v":""},null,{"$f":"IF(N18=\"X\",((($D18/1000)+prořez)*1)*$G18,IF(N18=\"Y\",((($F18/1000)+prořez)*1)*$G18,IF(N18=\"XX\",((($D18/1000)+prořez)*2)*$G18,IF(N18=\"YY\",((($F18/1000)+prořez)*2)*$G18,IF(N18=\"XY\",(((($D18/1000)+prořez))+(($F18/1000)+prořez))*$G18,IF(N18=\"XXY\",(((($D18/1000)+prořez)*2)+(($F18/1000)+prořez))*$G18,IF(N18=\"XYY\",(((($D18/1000)+prořez)+((($F18/1000)+prořez)*2)))*$G18,IF(N18=\"\",\"\",0))))))))","v":""},null,{"$f":"IF(P18=\"X\",((($D18/1000)+prořez)*1)*$G18,IF(P18=\"Y\",((($F18/1000)+prořez)*1)*$G18,IF(P18=\"XX\",((($D18/1000)+prořez)*2)*$G18,IF(P18=\"YY\",((($F18/1000)+prořez)*2)*$G18,IF(P18=\"XY\",(((($D18/1000)+prořez))+(($F18/1000)+prořez))*$G18,IF(P18=\"XXY\",(((($D18/1000)+prořez)*2)+(($F18/1000)+prořez))*$G18,IF(P18=\"XYY\",(((($D18/1000)+prořez)+((($F18/1000)+prořez)*2)))*$G18,IF(P18=\"\",\"\",0))))))))","v":""},{"$nulls":12},{"$f":"IF($J18=\"pant\",(($U$6*2)*$G18),\"\")","v":""},{"$f":"IF($J18=\"drážka\",($U$7*$G18),\"\")","v":""},{"$f":"IF($J18=\"falc\",($U$8*$G18),\"\")","v":""}]
[null,{"$f":"$B18+1","v":2},null,null,{"$f":"IF($D19=\"\",\"\",1)","v":""},null,null,{"$f":"IF($I19>0,((($D19+$F19)*2)/1000)*$G19,\"\")","v":0},{"$f":"IF($G19>0,(($D19*$F19)/1000000)*$G19,\"\")","v":""},{"$nulls":3},"",null,"",null,"",null,null,"Řezaní + Hranění",null,"drážka","Y",null,null,{"$f":"IF(L19=\"X\",((($D19/1000)+prořez)*1)*$G19,IF(L19=\"Y\",((($F19/1000)+prořez)*1)*$G19,IF(L19=\"XX\",((($D19/1000)+prořez)*2)*$G19,IF(L19=\"YY\",((($F19/1000)+prořez)*2)*$G19,IF(L19=\"XY\",(((($D19/1000)+prořez))+(($F19/1000)+prořez))*$G19,IF(L19=\"XXY\",(((($D19/1000)+prořez)*2)+(($F19/1000)+prořez))*$G19,IF(L19=\"XYY\",(((($D19/1000)+prořez)+((($F19/1000)+prořez)*2)))*$G19,IF(L19=\"\",\"\",0))))))))","v":""},null,"",null,"",{"$nulls":12},{"$f":"IF($J19=\"pant\",(($U$6*2)*$G19),\"\")","v":""},{"$f":"IF($J19=\"drážka\",($U$7*$G19),\"\")","v":""},{"$f":"IF($J19=\"falc\",($U$8*$G19),\"\")","v":""}]
[null,{"$f":"$B19+1","v":3},null,null,{"$f":"IF($D20=\"\",\"\",1)","v":""},null,null,0,"",{"$nulls":3},"",null,"",null,"",{"$nulls":4},"falc","XY",null,null,"",null,"",null,"",{"$nulls":12},"","",""]
{"$rows_left_out":40}
{"sheet":"formátovací list","index":1,"n_rows":61,"n_cols":23,"rows_kept":61,"hidden":true,"merged":[[0,3,3,8],[3,9,3,10],[3,11,3,14],[5,5,5,7],[5,9,5,14],[6,0,6,2],[6,6,6,14],[7,0,7,2],[7,6,7,14],[8,0,8,2],[8,6,8,14],[9,3,9,8],[9,9,9,11],[10,0,10,2],[10,3,10,8],[10,9,10,11],[11,0,11,2],[11,3,11,8],[11,9,11,11],[11,12,13,14],[12,0,12,2],[12,3,12,8],[12,9,12,11],[13,0,13,2],[13,3,13,8],[13,9,13,11],[14,0,14,14],[15,0,16,0],[15,1,16,1],[15,2,16,2],[15,3,15,5],[15,8,16,8],[15,9,15,14],[57,1,57,2],[58,1,58,2],[58,3,58,6],[60,10,60,12],[60,13,63,14],[62,0,62,2],[62,11,62,12]]}
[{"$nulls":3},"FORMÁTOVACÍ LIST"]
[]
[]
[{"$nulls":9},{"$f":"Poptávka!#REF!","v":{"$error":"#REF!"}},null,{"$f":"Poptávka!L4","v":0}]
[]
[" Firma (obchodní jméno):",null,null," IČO:",null,{"$f":"Poptávka!H6","v":0},null,null," DIČ:",{"$f":"Poptávka!#REF!","v":{"$error":"#REF!"}}]
[{"$f":"Poptávka!B7","v":0},null,null," Kontaktní osoba:",null,null,{"$f":"Poptávka!I7","v":0}]
[" Ulice, Město:",null,null,"PSČ:",null,"Tel:",{"$f":"Poptávka!I8","v":0}]
[{"$f":"Poptávka!B9","v":0},null,null,{"$f":"Poptávka!D10","v":"Dekor"},null,"e-mail:",{"$f":"Poptávka!I9","v":0},{"$nulls":14},"$"]
[{"$nulls":9},"Tloušťka - Šířka (mm)",null,null,"délka","šířka"]
["plošný materiál",null,null,{"$f":"Poptávka!F11","v":0},{"$nulls":5},{"$f":"Poptávka!#REF!","v":{"$error":"#REF!"}},null,null,{"$f":"Poptávka!L11","v":18},{"$f":"Poptávka!P11","v":1220}]
["papírová hrana",null,null,{"$f":"Poptávka!#REF!","v":{"$error":"#REF!"}},{"$nulls":5},{"$f":"Poptávka!#REF!","v":{"$error":"#REF!"}},null,null,"minimální cena za ohranění je     50,-Kč za každý druh hrany"]
["ABS 0,5mm",null,null,{"$f":"Poptávka!F12","v":0},{"$nulls":5},{"$f":"Poptávka!#REF!","v":{"$error":"#REF!"}}]
["ABS 2mm",null,null,{"$f":"Poptávka!F14","v":0},{"$nulls":5},{"$f":"Poptávka!#REF!","v":{"$error":"#REF!"}}]
["!!! uvedené rozměry přířezů jsou před ohraněním !!!"]
["Díl","orientace","Stručný název","Rozměry bez hran (mm)",null,null,"Počet",null,"m2","Umístění hran"]
[{"$nulls":3},"A=po letech",null,"B=napříč let","ks",null,null,"PAP","bm","ABS 0,5","bm","ABS 2","bm"]
[1,{"$f":"Poptávka!#REF!","v":{"$error":"#REF!"}},{"$f":"Poptávka!#REF!","v":{"$error":"#REF!"}},{"$f":"Poptávka!D18-W18","v":0},null,{"$f":"Poptávka!F18-T18","v":0},{"$f":"Poptávka!G18","v":0},"KS",{"$f":"((D18*F18)/1000000)*G18","v":{"v":0,"d":"0.000"}},{"$f":"Poptávka!#REF!","v":{"$error":"#REF!"}},{"$f":"Poptávka!#REF!","v":{"$error":"#REF!"}},{"$f":"Poptávka!L18","v":0},{"$f":"Poptávka!M18","v":""},{"$f":"Poptávka!P18","v":0},{"$f":"Poptávka!Q18","v":""},null,null,{"$f":"IF(OR(OR(N18=\"A\",N18=\"AB\"),N18=\"ABB\"),2,0)","v":0},{"$f":"IF(OR(OR(N18=\"AA\",N18=\"AAB\"),N18=\"AABB\"),4,0)","v":0},{"$f":"IF(Poptávka!$T$15=TRUE,R18+S18,0)","v":0},{"$f":"IF(OR(OR(N18=\"B\",N18=\"AB\"),N18=\"AAB\"),2,0)","v":0},{"$f":"IF(OR(OR(N18=\"BB\",N18=\"ABB\"),N18=\"AABB\"),4,0)","v":0},{"$f":"IF(Poptávka!$T$15=TRUE,U18+V18,0)","v":0}]
[{"$f":"A18+1","v":2},{"$f":"Poptávka!#REF!","v":{"$error":"#REF!"}},{"$f":"Poptávka!#REF!","v":{"$error":"#REF!"}},{"$f":"Poptávka!D19-W19","v":0},null,{"$f":"Poptávka!F19-T19","v":0},{"$f":"Poptávka!G19","v":0},"KS",{"$f":"#N/A","v":{"$error":"#N/A"}},{"$f":"Poptávka!#REF!","v":{"$error":"#REF!"}},{"$f":"Poptávka!#REF!","v":{"$error":"#REF!"}},{"$f":"Poptávka!L19","v":0},{"$f":"Poptávka!M19","v":""},{"$f":"Poptávka!P19","v":0},{"$f":"Poptávka!Q19","v":""},null,null,{"$f":"#N/A","v":0},{"$f":"#N/A","v":0},{"$f":"IF(Poptávka!$T$15=TRUE,R19+S19,0)","v":0},{"$f":"#N/A","v":{"$error":"#N/A"}},{"$f":"#N/A","v":{"$error":"#N/A"}},{"$f":"IF(Poptávka!$T$15=TRUE,U19+V19,0)","v":0}]
[{"$f":"#N/A","v":3},{"$f":"Poptávka!#REF!","v":{"$error":"#REF!"}},{"$f":"Poptávka!#REF!","v":{"$error":"#REF!"}},{"$f":"Poptávka!D20-W20","v":0},null,{"$f":"Poptávka!F20-T20","v":0},{"$f":"Poptávka!G20","v":0},"KS",{"$f":"#N/A","v":{"$error":"#N/A"}},{"$f":"Poptávka!#REF!","v":{"$error":"#REF!"}},{"$f":"Poptávka!#REF!","v":{"$error":"#REF!"}},{"$f":"Poptávka!L20","v":0},{"$f":"Poptávka!M20","v":""},{"$f":"Poptávka!P20","v":0},{"$f":"Poptávka!Q20","v":""},null,null,{"$f":"#N/A","v":0},{"$f":"#N/A","v":0},{"$f":"IF(Poptávka!$T$15=TRUE,R20+S20,0)","v":0},{"$f":"#N/A","v":{"$error":"#N/A"}},{"$f":"#N/A","v":{"$error":"#N/A"}},{"$f":"IF(Poptávka!$T$15=TRUE,U20+V20,0)","v":0}]
{"$rows_left_out":42}
{"sheet":"export","index":2,"n_rows":40,"n_cols":5,"rows_kept":40,"hidden":true}
[{"$f":"IF(AND(Poptávka!#REF!=\"\",Poptávka!G18>0),Poptávka!B18,Poptávka!#REF!)","v":{"$error":"#REF!"}},{"$f":"'formátovací list'!F18","v":0},{"$f":"'formátovací list'!D18","v":0},{"$f":"IF('formátovací list'!B18=\" \",\"\",IF('formátovací list'!B18=1,\"Y\",\"N\"))","v":{"$error":"#REF!"}},{"$f":"'formátovací list'!G18","v":0}]
[{"$f":"IF(AND(Poptávka!#REF!=\"\",Poptávka!G19>0),Poptávka!B19,Poptávka!#REF!)","v":{"$error":"#REF!"}},{"$f":"'formátovací list'!F19","v":0},{"$f":"'formátovací list'!D19","v":0},{"$f":"IF('formátovací list'!B19=\" \",\"\",IF('formátovací list'!B19=1,\"Y\",\"N\"))","v":{"$error":"#REF!"}},{"$f":"'formátovací list'!G19","v":0}]
[{"$f":"IF(AND(Poptávka!#REF!=\"\",Poptávka!G20>0),Poptávka!B20,Poptávka!#REF!)","v":{"$error":"#REF!"}},{"$f":"'formátovací list'!F20","v":0},{"$f":"'formátovací list'!D20","v":0},{"$f":"IF('formátovací list'!B20=\" \",\"\",IF('formátovací list'!B20=1,\"Y\",\"N\"))","v":{"$error":"#REF!"}},{"$f":"'formátovací list'!G20","v":0}]
[{"$f":"IF(AND(Poptávka!#REF!=\"\",Poptávka!G21>0),Poptávka!B21,Poptávka!#REF!)","v":{"$error":"#REF!"}},{"$f":"'formátovací list'!F21","v":0},{"$f":"'formátovací list'!D21","v":0},{"$f":"IF('formátovací list'!B21=\" \",\"\",IF('formátovací list'!B21=1,\"Y\",\"N\"))","v":{"$error":"#REF!"}},{"$f":"'formátovací list'!G21","v":0}]
[{"$f":"IF(AND(Poptávka!#REF!=\"\",Poptávka!G22>0),Poptávka!B22,Poptávka!#REF!)","v":{"$error":"#REF!"}},{"$f":"'formátovací list'!F22","v":0},{"$f":"'formátovací list'!D22","v":0},{"$f":"IF('formátovací list'!B22=\" \",\"\",IF('formátovací list'!B22=1,\"Y\",\"N\"))","v":{"$error":"#REF!"}},{"$f":"'formátovací list'!G22","v":0}]
[{"$f":"IF(AND(Poptávka!#REF!=\"\",Poptávka!G23>0),Poptávka!B23,Poptávka!#REF!)","v":{"$error":"#REF!"}},{"$f":"'formátovací list'!F23","v":0},{"$f":"'formátovací list'!D23","v":0},{"$f":"IF('formátovací list'!B23=\" \",\"\",IF('formátovací list'!B23=1,\"Y\",\"N\"))","v":{"$error":"#REF!"}},{"$f":"'formátovací list'!G23","v":0}]
[{"$f":"IF(AND(Poptávka!#REF!=\"\",Poptávka!G24>0),Poptávka!B24,Poptávka!#REF!)","v":{"$error":"#REF!"}},{"$f":"'formátovací list'!F24","v":0},{"$f":"'formátovací list'!D24","v":0},{"$f":"IF('formátovací list'!B24=\" \",\"\",IF('formátovací list'!B24=1,\"Y\",\"N\"))","v":{"$error":"#REF!"}},{"$f":"'formátovací list'!G24","v":0}]
[{"$f":"IF(AND(Poptávka!#REF!=\"\",Poptávka!G25>0),Poptávka!B25,Poptávka!#REF!)","v":{"$error":"#REF!"}},{"$f":"'formátovací list'!F25","v":0},{"$f":"'formátovací list'!D25","v":0},{"$f":"IF('formátovací list'!B25=\" \",\"\",IF('formátovací list'!B25=1,\"Y\",\"N\"))","v":{"$error":"#REF!"}},{"$f":"'formátovací list'!G25","v":0}]
[{"$f":"IF(AND(Poptávka!#REF!=\"\",Poptávka!G26>0),Poptávka!B26,Poptávka!#REF!)","v":{"$error":"#REF!"}},{"$f":"'formátovací list'!F26","v":0},{"$f":"'formátovací list'!D26","v":0},{"$f":"IF('formátovací list'!B26=\" \",\"\",IF('formátovací list'!B26=1,\"Y\",\"N\"))","v":{"$error":"#REF!"}},{"$f":"'formátovací list'!G26","v":0}]
[{"$f":"IF(AND(Poptávka!#REF!=\"\",Poptávka!G27>0),Poptávka!B27,Poptávka!#REF!)","v":{"$error":"#REF!"}},{"$f":"'formátovací list'!F27","v":0},{"$f":"'formátovací list'!D27","v":0},{"$f":"IF('formátovací list'!B27=\" \",\"\",IF('formátovací list'!B27=1,\"Y\",\"N\"))","v":{"$error":"#REF!"}},{"$f":"'formátovací list'!G27","v":0}]
[{"$f":"IF(AND(Poptávka!#REF!=\"\",Poptávka!G28>0),Poptávka!B28,Poptávka!#REF!)","v":{"$error":"#REF!"}},{"$f":"'formátovací list'!F28","v":0},{"$f":"'formátovací list'!D28","v":0},{"$f":"IF('formátovací list'!B28=\" \",\"\",IF('formátovací list'!B28=1,\"Y\",\"N\"))","v":{"$error":"#REF!"}},{"$f":"'formátovací list'!G28","v":0}]
[{"$f":"IF(AND(Poptávka!#REF!=\"\",Poptávka!G29>0),Poptávka!B29,Poptávka!#REF!)","v":{"$error":"#REF!"}},{"$f":"'formátovací list'!F29","v":0},{"$f":"'formátovací list'!D29","v":0},{"$f":"IF('formátovací list'!B29=\" \",\"\",IF('formátovací list'!B29=1,\"Y\",\"N\"))","v":{"$error":"#REF!"}},{"$f":"'formátovací list'!G29","v":0}]
[{"$f":"IF(AND(Poptávka!#REF!=\"\",Poptávka!G30>0),Poptávka!B30,Poptávka!#REF!)","v":{"$error":"#REF!"}},{"$f":"'formátovací list'!F30","v":0},{"$f":"'formátovací list'!D30","v":0},{"$f":"IF('formátovací list'!B30=\" \",\"\",IF('formátovací list'!B30=1,\"Y\",\"N\"))","v":{"$error":"#REF!"}},{"$f":"'formátovací list'!G30","v":0}]
[{"$f":"IF(AND(Poptávka!#REF!=\"\",Poptávka!G31>0),Poptávka!B31,Poptávka!#REF!)","v":{"$error":"#REF!"}},{"$f":"'formátovací list'!F31","v":0},{"$f":"'formátovací list'!D31","v":0},{"$f":"IF('formátovací list'!B31=\" \",\"\",IF('formátovací list'!B31=1,\"Y\",\"N\"))","v":{"$error":"#REF!"}},{"$f":"'formátovací list'!G31","v":0}]
[{"$f":"IF(AND(Poptávka!#REF!=\"\",Poptávka!G32>0),Poptávka!B32,Poptávka!#REF!)","v":{"$error":"#REF!"}},{"$f":"'formátovací list'!F32","v":0},{"$f":"'formátovací list'!D32","v":0},{"$f":"IF('formátovací list'!B32=\" \",\"\",IF('formátovací list'!B32=1,\"Y\",\"N\"))","v":{"$error":"#REF!"}},{"$f":"'formátovací list'!G32","v":0}]
[{"$f":"IF(AND(Poptávka!#REF!=\"\",Poptávka!#REF!>0),Poptávka!#REF!,Poptávka!#REF!)","v":{"$error":"#REF!"}},{"$f":"'formátovací list'!F33","v":{"$error":"#REF!"}},{"$f":"'formátovací list'!D33","v":{"$error":"#REF!"}},{"$f":"IF('formátovací list'!B33=\" \",\"\",IF('formátovací list'!B33=1,\"Y\",\"N\"))","v":{"$error":"#REF!"}},{"$f":"'formátovací list'!G33","v":{"$error":"#REF!"}}]
[{"$f":"IF(AND(Poptávka!#REF!=\"\",Poptávka!#REF!>0),Poptávka!#REF!,Poptávka!#REF!)","v":{"$error":"#REF!"}},{"$f":"'formátovací list'!F34","v":{"$error":"#REF!"}},{"$f":"'formátovací list'!D34","v":{"$error":"#REF!"}},{"$f":"IF('formátovací list'!B34=\" \",\"\",IF('formátovací list'!B34=1,\"Y\",\"N\"))","v":{"$error":"#REF!"}},{"$f":"'formátovací list'!G34","v":{"$error":"#REF!"}}]
[{"$f":"IF(AND(Poptávka!#REF!=\"\",Poptávka!#REF!>0),Poptávka!#REF!,Poptávka!#REF!)","v":{"$error":"#REF!"}},{"$f":"'formátovací list'!F35","v":{"$error":"#REF!"}},{"$f":"'formátovací list'!D35","v":{"$error":"#REF!"}},{"$f":"IF('formátovací list'!B35=\" \",\"\",IF('formátovací list'!B35=1,\"Y\",\"N\"))","v":{"$error":"#REF!"}},{"$f":"'formátovací list'!G35","v":{"$error":"#REF!"}}]
[{"$f":"IF(AND(Poptávka!#REF!=\"\",Poptávka!#REF!>0),Poptávka!#REF!,Poptávka!#REF!)","v":{"$error":"#REF!"}},{"$f":"'formátovací list'!F36","v":{"$error":"#REF!"}},{"$f":"'formátovací list'!D36","v":{"$error":"#REF!"}},{"$f":"IF('formátovací list'!B36=\" \",\"\",IF('formátovací list'!B36=1,\"Y\",\"N\"))","v":{"$error":"#REF!"}},{"$f":"'formátovací list'!G36","v":{"$error":"#REF!"}}]
[{"$f":"IF(AND(Poptávka!#REF!=\"\",Poptávka!#REF!>0),Poptávka!#REF!,Poptávka!#REF!)","v":{"$error":"#REF!"}},{"$f":"'formátovací list'!F37","v":{"$error":"#REF!"}},{"$f":"'formátovací list'!D37","v":{"$error":"#REF!"}},{"$f":"IF('formátovací list'!B37=\" \",\"\",IF('formátovací list'!B37=1,\"Y\",\"N\"))","v":{"$error":"#REF!"}},{"$f":"'formátovací list'!G37","v":{"$error":"#REF!"}}]
{"$rows_left_out":20}